{"text_format":"1","workbook":"xlsx","n_sheets":5,"sheets":["Map","Data","Control","City","Palette"],"not_rendered":{"charts":1,"images":0,"macros":1,"external_links":0,"defined_names":441,"comments":0,"pivot_tables":0},"unopened":[],"bounds":{"document_bytes":16777216,"sheet_cells":100000,"rows_first":2000,"rows_last":500,"rows_between":2000,"halvings":0,"cell_chars":16384,"cell_head_chars":4096},"cells_cut":0,"cells_raw":0,"read":"whole","date_system":"1900"}

{"sheet":"Map","index":0,"n_rows":35,"n_cols":12,"rows_kept":35,"cut":false,"hidden":false,"merged":[[20,7,20,9]]}
[]
[]
[]
[]
[]
[]
[]
[]
[]
[]
[]
[]
[]
[]
[]
[]
[]
[]
[]
[]
[null,null,null,null,null,null,null,"Legend"]
[null,null,null,null,null,null,null,">=",null,{"$f":"Control!D12","v":25},null,"Map colors"]
[null,null,null,null,null,null,null,{"$f":"Control!D11","v":20},"-",{"$f":"Control!D12","v":25}]
[null,null,null,null,null,null,null,{"$f":"Control!D10","v":15},"-",{"$f":"Control!D11","v":20}]
[null,null,null,null,null,null,null,{"$f":"Control!D9","v":10},"-",{"$f":"Control!D10","v":15}]
[null,null,null,null,null,null,null,{"$f":"Control!D8","v":5},"-",{"$f":"Control!D9","v":10}]
[null,null,null,null,null,null,null,{"$f":"Control!D7","v":0},"-",{"$f":"Control!D8","v":5}]
[null,null,null,null,null,null,null,{"$f":"Control!D6","v":-5},"-",{"$f":"Control!D7","v":0}]
[null,null,null,null,null,null,null,{"$f":"Control!D5","v":-10},"-",{"$f":"Control!D6","v":-5}]
[null,null,null,null,null,null,null,{"$f":"Control!D4","v":-15},"-",{"$f":"Control!D5","v":-10},null,"Bubble chart coloring"]
[null,null,null,null,null,null,null,{"$f":"Control!D3","v":-20},"-",{"$f":"Control!D4","v":-15}]
[null,null,null,null,null,null,null,"<",null,{"$f":"Control!D3","v":-20}]
[null,null,null,null,null,null,null,null,null,null,null,"Bubble size"]
[]
["Chart created with Excel Map of Germany, version Demo, © SkuteczneRaporty.pl"]

{"sheet":"Data","index":1,"n_rows":63,"n_cols":12,"rows_kept":63,"cut":false,"hidden":false,"merged":[]}
["Bundesland","Seat","Value","Bubble size","Bubble color",null,null,null,null,"Bins",null,"Bins on map"]
["Baden-Württemberg","Stuttgart",null,null,null,null,null,null,"Min",-20,"<",{"$f":"J2","v":-20}]
[null,null,null,null,null,null,null,null,null,-15,"<",-15]
[null,null,null,null,null,null,null,null,null,-10,"<",-10]
[null,null,null,null,null,null,null,null,null,-5,"<",-5]
[null,null,null,null,null,null,null,null,null,0,"<",0]
[null,null,null,null,null,null,null,null,null,5,"<",5]
[null,null,null,null,null,null,null,null,null,10,"<",10]
[null,null,null,null,null,null,null,null,null,15,"<",15]
[null,null,null,null,null,null,null,null,null,20,"<",20]
[null,null,null,null,null,null,null,null,"Max",25,"<",25]
[null,null,null,null,null,null,null,null,null,null,">=",{"$f":"J11","v":25}]
[]
[]
[]
[]
[]
[]
["Landkreis/Kreis/Stadt","Type","Bundesland","Seat","Value","Bubble size","Bubble color"]
["Alb-Donau-Kreis","Kreis","Baden-Württemberg","Ulm"]
["Baden-Baden","Stadt","Baden-Württemberg","Baden-Baden"]
["Biberach","Kreis","Baden-Württemberg","Biberach an der Riß"]
["Böblingen","Kreis","Baden-Württemberg","Böblingen"]
["Bodenseekreis","Kreis","Baden-Württemberg","Friedrichshafen"]
["Breisgau-Hochschwarzwald","Kreis","Baden-Württemberg","Freiburg im Breisgau"]
["Calw","Kreis","Baden-Württemberg","Calw"]
["Emmendingen","Kreis","Baden-Württemberg","Emmendingen"]
["Enzkreis","Kreis","Baden-Württemberg","Pforzheim"]
["Esslingen","Kreis","Baden-Württemberg","Esslingen am Neckar"]
["Freiburg im Breisgau","Stadt","Baden-Württemberg","Freiburg im Breisgau"]
["Freudenstadt","Kreis","Baden-Württemberg","Freudenstadt"]
["Göppingen","Kreis","Baden-Württemberg","Göppingen"]
["Heidelberg","Stadt","Baden-Württemberg","Heidelberg"]
["Heidenheim","Kreis","Baden-Württemberg","Heidenheim an der Brenz"]
["Heilbronn","Kreis","Baden-Württemberg","Heilbronn"]
["Heilbronn","Stadt","Baden-Württemberg","Heilbronn"]
["Hohenlohekreis","Kreis","Baden-Württemberg","Künzelsau"]
["Karlsruhe","Kreis","Baden-Württemberg","Karlsruhe"]
["Karlsruhe","Stadt","Baden-Württemberg","Karlsruhe"]
["Konstanz","Kreis","Baden-Württemberg","Konstanz"]
{"$rows_left_out":24}
{"sheet":"Control","index":2,"n_rows":430,"n_cols":20,"rows_kept":430,"cut":false,"hidden":true,"merged":[]}
["Code","Shape",null,"Bins","RGB code","Color code","Value",null,1,"on",null,1,null,null,null,null,null,null,null,15]
["d_kolor1","s_kolor1",null,{"$f":"D3-1000000","v":-1000020},{"$f":"INDEX(Palette!$A$1:$L$10,$I$1,ROW(E2))","v":2031719},"kolor11",{"$f":"D2","v":-1000020},null,null,"off",null,{"$f":"#REF!","v":{"$error":"#REF!"}}]
["d_kolor2","s_kolor2",null,{"$f":"Data!J2","v":-20},{"$f":"INDEX(Palette!$A$1:$L$10,$I$1,ROW(E3))","v":2824370},"kolor10",{"$f":"D3","v":-20},null,null,2,null,{"$f":"#REF!","v":{"$error":"#REF!"}}]
["d_kolor3","s_kolor3",null,{"$f":"Data!J3","v":-15},{"$f":"INDEX(Palette!$A$1:$L$10,$I$1,ROW(E4))","v":5071062},"kolor9",{"$f":"D4","v":-15},null,null,null,null,{"$f":"#REF!","v":{"$error":"#REF!"}}]
["d_kolor4","s_kolor4",null,{"$f":"Data!J4","v":-10},{"$f":"INDEX(Palette!$A$1:$L$10,$I$1,ROW(E5))","v":8562164},"kolor8",-10,null,"Number",0,null,{"$f":"#REF!","v":{"$error":"#REF!"}}]
["d_kolor5","s_kolor5",null,{"$f":"Data!J5","v":-5},{"$f":"INDEX(Palette!$A$1:$L$10,$I$1,ROW(E6))","v":13097981},"kolor7",-5,null,"Area",{"$f":"IF(Numer>0,INDEX(Data!$B$20:$B$421,Numer,1)&\": \"&INDEX(Data!$A$20:$A$421,Numer,1)&\" (\"&INDEX(Data!$C$20:$C$421,Numer,1)&\")\",\"\")","v":""},null,{"$f":"#REF!","v":{"$error":"#REF!"}}]
["d_kolor6","s_kolor6",null,{"$f":"Data!J6","v":0},{"$f":"INDEX(Palette!$A$1:$L$10,$I$1,ROW(E7))","v":16250871},"kolor6",0,null,"Format","0,00",null,{"$f":"#REF!","v":{"$error":"#REF!"}}]
["d_kolor7","s_kolor7",null,{"$f":"Data!J7","v":5},{"$f":"INDEX(Palette!$A$1:$L$10,$I$1,ROW(E8))","v":15787473},"kolor5",5,null,"Value",{"$f":"IF(Numer>0,TEXT(INDEX(Data!$E$20:$E$421,Numer,1),Format),\"\")","v":""},null,{"$f":"#REF!","v":{"$error":"#REF!"}}]
["d_kolor8","s_kolor8",null,{"$f":"Data!J8","v":10},{"$f":"INDEX(Palette!$A$1:$L$10,$I$1,ROW(E9))","v":14599570},"kolor4",10,null,"Number2",112,null,{"$f":"#REF!","v":{"$error":"#REF!"}}]
["d_kolor9","s_kolor9",null,{"$f":"Data!J9","v":15},{"$f":"INDEX(Palette!$A$1:$L$10,$I$1,ROW(E10))","v":12817219},"kolor3",15,null,null,null,null,{"$f":"#REF!","v":{"$error":"#REF!"}}]
["d_kolor10","s_kolor10",null,{"$f":"Data!J10","v":20},{"$f":"INDEX(Palette!$A$1:$L$10,$I$1,ROW(E11))","v":11298337},"kolor2",20,null,null,null,null,{"$f":"#REF!","v":{"$error":"#REF!"}}]
["d_kolor11","s_kolor11",null,{"$f":"Data!J11","v":25},{"$f":"INDEX(Palette!$A$1:$L$10,$I$1,ROW(E12))","v":6369285},"kolor1",25]
["s_Alb_Donau_Kreis","Alb_Donau_Kreis"]
["s_Baden_Baden","Baden_Baden"]
["s_Biberach","Biberach"]
["s_Böblingen","Böblingen"]
["s_Bodenseekreis","Bodenseekreis"]
["s_Breisgau_Hochschwarzwald","Breisgau_Hochschwarzwald"]
["s_Calw","Calw"]
["s_Emmendingen","Emmendingen"]
["s_Enzkreis","Enzkreis"]
["s_Esslingen","Esslingen"]
["s_Freiburg_im_Breisgau","Freiburg_im_Breisgau"]
["s_Freudenstadt","Freudenstadt"]
["s_Göppingen","Göppingen"]
["s_Heidelberg","Heidelberg"]
["s_Heidenheim","Heidenheim"]
["s_Heilbronn","Heilbronn"]
["s_Heilbronn_s","Heilbronn_s"]
["s_Hohenlohekreis","Hohenlohekreis"]
["s_Karlsruhe","Karlsruhe"]
["s_Karlsruhe_s","Karlsruhe_s"]
["s_Konstanz","Konstanz"]
["s_Lörrach","Lörrach"]
["s_Ludwigsburg","Ludwigsburg"]
["s_Main_Tauber_Kreis","Main_Tauber_Kreis"]
["s_Mannheim","Mannheim"]
["s_Neckar_Odenwald_Kreis","Neckar_Odenwald_Kreis"]
["s_Ortenaukreis","Ortenaukreis"]
["s_Ostalbkreis","Ostalbkreis"]
{"$rows_left_out":391}
{"sheet":"City","index":3,"n_rows":2324,"n_cols":21,"rows_kept":2324,"cut":false,"hidden":true,"merged":[]}
["Bundesland","City","Longitude","Latitude","Bubble size","Bubble color","Bubble bins","Bubble bins on map",null,"Poziom","Poziom1","Poziom2","Poziom3","Poziom4","Poziom5","Poziom6","Poziom7","Poziom8","Poziom9","Poziom10","Poziom11"]
["Schleswig-Holstein","Heide",9.1019009999999998,54.195175999999996,{"$f":"IF(ISERROR(VLOOKUP(B2,miasta,3,0)),\"\",VLOOKUP(B2,miasta,3,0))","v":""},{"$f":"IF(ISERROR(VLOOKUP(City!B2,miasta,4,0)),\"\",IF(VLOOKUP(City!B2,miasta,4,0)=\"\",\"\",VLOOKUP(City!B2,miasta,4,0)))","v":""},{"$f":"G3-1000000","v":-1000020},{"$f":"\"<\"&G3","v":"<-20"},1,{"$f":"IF(ISERROR(VLOOKUP(F2,$G$2:$I$12,3,1)),\"\",VLOOKUP(F2,$G$2:$I$12,3,1))","v":""},{"$f":"IF($J2=COLUMN(K2)-10,$E2,\"\")","v":""},"","","","","","","","","",""]
["Schleswig-Holstein","Ratzeburg",10.77106,53.698962999999999,"",{"$f":"IF(ISERROR(VLOOKUP(City!B3,miasta,4,0)),\"\",IF(VLOOKUP(City!B3,miasta,4,0)=\"\",\"\",VLOOKUP(City!B3,miasta,4,0)))","v":""},{"$f":"Data!J2","v":-20},{"$f":"\"<\"&G4","v":"<-15"},2,{"$f":"IF(ISERROR(VLOOKUP(F3,$G$2:$I$12,3,1)),\"\",VLOOKUP(F3,$G$2:$I$12,3,1))","v":""},{"$f":"IF($J3=COLUMN(K3)-10,$E3,\"\")","v":""},"","","","","","","","","",""]
["Schleswig-Holstein","Husum",9.0600629999999995,54.483764000000001,"",{"$f":"IF(ISERROR(VLOOKUP(City!B4,miasta,4,0)),\"\",IF(VLOOKUP(City!B4,miasta,4,0)=\"\",\"\",VLOOKUP(City!B4,miasta,4,0)))","v":""},{"$f":"Data!J3","v":-15},{"$f":"\"<\"&G5","v":"<-10"},3,"","","","","","","","","","","",""]
["Schleswig-Holstein","Eutin",10.609505,54.133028000000003,"",{"$f":"IF(ISERROR(VLOOKUP(City!B5,miasta,4,0)),\"\",IF(VLOOKUP(City!B5,miasta,4,0)=\"\",\"\",VLOOKUP(City!B5,miasta,4,0)))","v":""},{"$f":"Data!J4","v":-10},"<-5",4,"","","","","","","","","","","",""]
["Schleswig-Holstein","Pinneberg",9.7938209999999994,53.654522999999998,"",{"$f":"IF(ISERROR(VLOOKUP(City!B6,miasta,4,0)),\"\",IF(VLOOKUP(City!B6,miasta,4,0)=\"\",\"\",VLOOKUP(City!B6,miasta,4,0)))","v":""},{"$f":"Data!J5","v":-5},"<0",5,"","","","","","","","","","","",""]
["Schleswig-Holstein","Plön",10.42595,54.16133,"",{"$f":"IF(ISERROR(VLOOKUP(City!B7,miasta,4,0)),\"\",IF(VLOOKUP(City!B7,miasta,4,0)=\"\",\"\",VLOOKUP(City!B7,miasta,4,0)))","v":""},{"$f":"Data!J6","v":0},"<5",6,"","","","","","","","","","","",""]
["Schleswig-Holstein","Rendsburg",9.6589910000000003,54.307549000000002,"",{"$f":"IF(ISERROR(VLOOKUP(City!B8,miasta,4,0)),\"\",IF(VLOOKUP(City!B8,miasta,4,0)=\"\",\"\",VLOOKUP(City!B8,miasta,4,0)))","v":""},{"$f":"Data!J7","v":5},"<10",7,"","","","","","","","","","","",""]
["Schleswig-Holstein","Schleswig",9.5632269999999995,54.523930999999997,"",{"$f":"IF(ISERROR(VLOOKUP(City!B9,miasta,4,0)),\"\",IF(VLOOKUP(City!B9,miasta,4,0)=\"\",\"\",VLOOKUP(City!B9,miasta,4,0)))","v":""},{"$f":"Data!J8","v":10},"<15",8,"","","","","","","","","","","",""]
["Schleswig-Holstein","Bad Segeberg",10.305365,53.939053000000001,"",{"$f":"IF(ISERROR(VLOOKUP(City!B10,miasta,4,0)),\"\",IF(VLOOKUP(City!B10,miasta,4,0)=\"\",\"\",VLOOKUP(City!B10,miasta,4,0)))","v":""},{"$f":"Data!J9","v":15},"<20",9,"","","","","","","","","","","",""]
["Schleswig-Holstein","Itzehoe",9.5121120000000001,53.934845000000003,"",{"$f":"IF(ISERROR(VLOOKUP(City!B11,miasta,4,0)),\"\",IF(VLOOKUP(City!B11,miasta,4,0)=\"\",\"\",VLOOKUP(City!B11,miasta,4,0)))","v":""},{"$f":"Data!J10","v":20},"<25",10,"","","","","","","","","","","",""]
["Schleswig-Holstein","Bad Oldesloe",10.373953,53.806483,"",{"$f":"IF(ISERROR(VLOOKUP(City!B12,miasta,4,0)),\"\",IF(VLOOKUP(City!B12,miasta,4,0)=\"\",\"\",VLOOKUP(City!B12,miasta,4,0)))","v":""},{"$f":"Data!J11","v":25},{"$f":"\">=\"&G12","v":">=25"},11,"","","","","","","","","","","",""]
["Niedersachsen","Gifhorn",10.549576,52.477116000000002,"",{"$f":"IF(ISERROR(VLOOKUP(City!B13,miasta,4,0)),\"\",IF(VLOOKUP(City!B13,miasta,4,0)=\"\",\"\",VLOOKUP(City!B13,miasta,4,0)))","v":""},null,null,null,"","","","","","","","","","","",""]
["Niedersachsen","Göttingen",9.9296900000000008,51.538352000000003,"",{"$f":"IF(ISERROR(VLOOKUP(City!B14,miasta,4,0)),\"\",IF(VLOOKUP(City!B14,miasta,4,0)=\"\",\"\",VLOOKUP(City!B14,miasta,4,0)))","v":""},null,null,null,"","","","","","","","","","","",""]
["Niedersachsen","Goslar",10.446574999999999,51.908334000000004,"",{"$f":"IF(ISERROR(VLOOKUP(City!B15,miasta,4,0)),\"\",IF(VLOOKUP(City!B15,miasta,4,0)=\"\",\"\",VLOOKUP(City!B15,miasta,4,0)))","v":""},null,null,null,"","","","","","","","","","","",""]
["Niedersachsen","Helmstedt",11.009544,52.228966,"",{"$f":"IF(ISERROR(VLOOKUP(City!B16,miasta,4,0)),\"\",IF(VLOOKUP(City!B16,miasta,4,0)=\"\",\"\",VLOOKUP(City!B16,miasta,4,0)))","v":""},null,null,null,"","","","","","","","","","","",""]
["Niedersachsen","Northeim",9.9959059999999997,51.700178999999999,"",{"$f":"IF(ISERROR(VLOOKUP(City!B17,miasta,4,0)),\"\",IF(VLOOKUP(City!B17,miasta,4,0)=\"\",\"\",VLOOKUP(City!B17,miasta,4,0)))","v":""},null,null,null,"","","","","","","","","","","",""]
["Niedersachsen","Osterode am Harz",10.258031000000001,51.729376999999999,"",{"$f":"IF(ISERROR(VLOOKUP(City!B18,miasta,4,0)),\"\",IF(VLOOKUP(City!B18,miasta,4,0)=\"\",\"\",VLOOKUP(City!B18,miasta,4,0)))","v":""},null,null,null,"","","","","","","","","","","",""]
["Niedersachsen","Peine",10.243266999999999,52.320410000000003,"",{"$f":"IF(ISERROR(VLOOKUP(City!B19,miasta,4,0)),\"\",IF(VLOOKUP(City!B19,miasta,4,0)=\"\",\"\",VLOOKUP(City!B19,miasta,4,0)))","v":""},null,null,null,"","","","","","","","","","","",""]
["Niedersachsen","Wolfenbüttel",10.540848,52.164040999999997,"",{"$f":"IF(ISERROR(VLOOKUP(City!B20,miasta,4,0)),\"\",IF(VLOOKUP(City!B20,miasta,4,0)=\"\",\"\",VLOOKUP(City!B20,miasta,4,0)))","v":""},null,null,null,"","","","","","","","","","","",""]
["Niedersachsen","Hannover",9.7320100000000007,52.375892,"",{"$f":"IF(ISERROR(VLOOKUP(City!B21,miasta,4,0)),\"\",IF(VLOOKUP(City!B21,miasta,4,0)=\"\",\"\",VLOOKUP(City!B21,miasta,4,0)))","v":""},null,null,null,"","","","","","","","","","","",""]
["Niedersachsen","Diepholz",8.3707879999999992,52.605646,"",{"$f":"IF(ISERROR(VLOOKUP(City!B22,miasta,4,0)),\"\",IF(VLOOKUP(City!B22,miasta,4,0)=\"\",\"\",VLOOKUP(City!B22,miasta,4,0)))","v":""},null,null,null,"","","","","","","","","","","",""]
["Niedersachsen","Hameln",9.3657629999999994,52.108687000000003,"",{"$f":"IF(ISERROR(VLOOKUP(City!B23,miasta,4,0)),\"\",IF(VLOOKUP(City!B23,miasta,4,0)=\"\",\"\",VLOOKUP(City!B23,miasta,4,0)))","v":""},null,null,null,"","","","","","","","","","","",""]
["Niedersachsen","Hildesheim",9.9658680000000004,52.140954000000001,"",{"$f":"IF(ISERROR(VLOOKUP(City!B24,miasta,4,0)),\"\",IF(VLOOKUP(City!B24,miasta,4,0)=\"\",\"\",VLOOKUP(City!B24,miasta,4,0)))","v":""},null,null,null,"","","","","","","","","","","",""]
["Niedersachsen","Holzminden",9.4599200000000003,51.825268999999999,"",{"$f":"IF(ISERROR(VLOOKUP(City!B25,miasta,4,0)),\"\",IF(VLOOKUP(City!B25,miasta,4,0)=\"\",\"\",VLOOKUP(City!B25,miasta,4,0)))","v":""},null,null,null,"","","","","","","","","","","",""]
["Niedersachsen","Nienburg/Weser",9.2557620000000007,52.635260000000002,"",{"$f":"IF(ISERROR(VLOOKUP(City!B26,miasta,4,0)),\"\",IF(VLOOKUP(City!B26,miasta,4,0)=\"\",\"\",VLOOKUP(City!B26,miasta,4,0)))","v":""},null,null,null,"","","",{"$f":"IF($J26=COLUMN(M26)-10,$E26,\"\")","v":""},"","","","","","","",""]
["Niedersachsen","Stadthagen",9.1998230000000003,52.325209999999998,"",{"$f":"IF(ISERROR(VLOOKUP(City!B27,miasta,4,0)),\"\",IF(VLOOKUP(City!B27,miasta,4,0)=\"\",\"\",VLOOKUP(City!B27,miasta,4,0)))","v":""},null,null,null,"",{"$f":"IF($J27=COLUMN(K27)-10,$E27,\"\")","v":""},"","","","","","","","","",""]
["Niedersachsen","Celle",10.063193999999999,52.616810999999998,"",{"$f":"IF(ISERROR(VLOOKUP(City!B28,miasta,4,0)),\"\",IF(VLOOKUP(City!B28,miasta,4,0)=\"\",\"\",VLOOKUP(City!B28,miasta,4,0)))","v":""},null,null,null,"","","","","","","","","","","",""]
["Niedersachsen","Cuxhaven",8.6930420000000002,53.863245999999997,"",{"$f":"IF(ISERROR(VLOOKUP(City!B29,miasta,4,0)),\"\",IF(VLOOKUP(City!B29,miasta,4,0)=\"\",\"\",VLOOKUP(City!B29,miasta,4,0)))","v":""},null,null,null,"","","","","","","","","","","",""]
["Niedersachsen","Winsen (Luhe)",10.212719999999999,53.357444000000001,"",{"$f":"IF(ISERROR(VLOOKUP(City!B30,miasta,4,0)),\"\",IF(VLOOKUP(City!B30,miasta,4,0)=\"\",\"\",VLOOKUP(City!B30,miasta,4,0)))","v":""},null,null,null,"","","","","","","","","","","",""]
["Niedersachsen","Lüchow (Wendland)",11.156798,52.970165000000001,"",{"$f":"IF(ISERROR(VLOOKUP(City!B31,miasta,4,0)),\"\",IF(VLOOKUP(City!B31,miasta,4,0)=\"\",\"\",VLOOKUP(City!B31,miasta,4,0)))","v":""},null,null,null,"","","","","","","","","","","",""]
["Niedersachsen","Lüneburg",10.411517999999999,53.246420999999998,"",{"$f":"IF(ISERROR(VLOOKUP(City!B32,miasta,4,0)),\"\",IF(VLOOKUP(City!B32,miasta,4,0)=\"\",\"\",VLOOKUP(City!B32,miasta,4,0)))","v":""},null,null,null,"","","","","","","","","","","",""]
["Niedersachsen","Osterholz-Scharmbeck",8.7900849999999995,53.227708,"",{"$f":"IF(ISERROR(VLOOKUP(City!B33,miasta,4,0)),\"\",IF(VLOOKUP(City!B33,miasta,4,0)=\"\",\"\",VLOOKUP(City!B33,miasta,4,0)))","v":""},null,null,null,"","","","","","","","","","","",""]
["Niedersachsen","Rotenburg (Wümme)",9.4,53.1,"",{"$f":"IF(ISERROR(VLOOKUP(City!B34,miasta,4,0)),\"\",IF(VLOOKUP(City!B34,miasta,4,0)=\"\",\"\",VLOOKUP(City!B34,miasta,4,0)))","v":""},null,null,null,"","","","","","","","","","","",""]
["Niedersachsen","Bad Fallingbostel",9.6957629999999995,52.866756000000002,"",{"$f":"IF(ISERROR(VLOOKUP(City!B35,miasta,4,0)),\"\",IF(VLOOKUP(City!B35,miasta,4,0)=\"\",\"\",VLOOKUP(City!B35,miasta,4,0)))","v":""},null,null,null,"","","","","","","","","","","",""]
["Niedersachsen","Stade",9.4709489999999992,53.592861999999997,"",{"$f":"IF(ISERROR(VLOOKUP(City!B36,miasta,4,0)),\"\",IF(VLOOKUP(City!B36,miasta,4,0)=\"\",\"\",VLOOKUP(City!B36,miasta,4,0)))","v":""},null,null,null,"","","","","","","","","","","",""]
["Niedersachsen","Uelzen",10.55803,52.965820000000001,"",{"$f":"IF(ISERROR(VLOOKUP(City!B37,miasta,4,0)),\"\",IF(VLOOKUP(City!B37,miasta,4,0)=\"\",\"\",VLOOKUP(City!B37,miasta,4,0)))","v":""},null,null,null,"","","","","","","","","","","",""]
["Niedersachsen","Verden (Aller)",9.2378269999999993,52.924954,"",{"$f":"IF(ISERROR(VLOOKUP(City!B38,miasta,4,0)),\"\",IF(VLOOKUP(City!B38,miasta,4,0)=\"\",\"\",VLOOKUP(City!B38,miasta,4,0)))","v":""},null,null,null,"","","","","","","","","","","",""]
["Niedersachsen","Westerstede",7.9263659999999998,53.255073000000003,"",{"$f":"IF(ISERROR(VLOOKUP(City!B39,miasta,4,0)),\"\",IF(VLOOKUP(City!B39,miasta,4,0)=\"\",\"\",VLOOKUP(City!B39,miasta,4,0)))","v":""},null,null,null,"","","","","","","","","","","",""]
["Niedersachsen","Aurich",7.4848309999999998,53.470838999999998,"",{"$f":"IF(ISERROR(VLOOKUP(City!B40,miasta,4,0)),\"\",IF(VLOOKUP(City!B40,miasta,4,0)=\"\",\"\",VLOOKUP(City!B40,miasta,4,0)))","v":""},null,null,null,"","","","","","","","","","","",""]
{"$rows_left_out":2285}
{"sheet":"Palette","index":4,"n_rows":22,"n_cols":12,"rows_kept":22,"cut":false,"hidden":true,"merged":[]}
["red-blue",2031719,2824370,5071062,8562164,13097981,16250871,15787473,14599570,12817219,11298337,6369285]
["red-yellow-violet",4325790,5193429,4419060,6401789,9167102,12582911,10024422,10804651,10863206,12421170,10637150]
["red-green",2490533,2568407,4419060,6401789,9167102,12582911,9170905,7002534,6536550,5281818,3631104]
["red-black",2031719,2824370,5071062,8562164,13097981,16777215,14737632,12237498,8882055,5066061,1710618]
["brown-blue",340052,676236,2982335,8241887,12839158,16119285,15067847,12701056,9410357,6186497,3161088]
["yellow",16777215,15073279,12384255,9561086,5227774,2726398,1339628,150732,275609,402790,0]
["red",16777215,15791615,13820158,10599420,7508732,4877051,2898927,1906891,1380261,852071,0]
["green",16777215,16121079,14743013,12642759,10213793,7783540,6138689,4557603,2911488,1786880,0]
["blue",16777215,16776183,16247774,15719366,14797470,14069355,13013570,11890977,10244360,7024648,0]
["black",16777215,16777215,15790320,14277081,12434877,9868950,7566195,5395026,2434341,1710618,0]
[]
[null,"Red","Green","Blue","RGB","[funkcja kod_RGB]"]
[null,255,255,255,{"$f":"kod_RGB(B13,C13,D13)","v":16777215}]
[null,111,111,200,{"$f":"kod_RGB(B14,C14,D14)","v":13135727}]
[null,null,null,null,0]
[null,null,null,null,0]
[null,null,null,null,0]
[null,null,null,null,0]
[null,null,null,null,0]
[null,null,null,null,0]
[null,null,null,null,0]
[null,null,null,null,0]